Information card for entry 7709551
Formula | C103.94 H99.82 Cl1.06 Cu4 N24 O17.44 |
Calculated formula | C103.94 H99.82 Cl1.06 Cu4 N24 O17.44 |
Title of publication | Discovery of thirteen cobalt (II) and copper (II) salicylaldehyde Schiff base complexes that induce apoptosis and autophagy in human lung adenocarcinoma A549/DDP cells and that can overcome cisplatin resistance in vitro and in vivo |
Authors of publication | Chen, Yating; Zhang, Shaonan; Wang, Zhen-Feng; Wei, Qingmin; Zhang, Shuhua |
Journal of publication | Dalton Transactions |
Year of publication | 2022 |
a | 10.2555 ± 0.0005 Å |
b | 15.0401 ± 0.0007 Å |
c | 17.0183 ± 0.0007 Å |
α | 88.11 ± 0.004° |
β | 87.004 ± 0.004° |
γ | 83.153 ± 0.004° |
Cell volume | 2601.7 ± 0.2 Å3 |
Cell temperature | 293 ± 2 K |
Ambient diffraction temperature | 293 ± 2 K |
Number of distinct elements | 6 |
Space group number | 2 |
Hermann-Mauguin space group symbol | P -1 |
Hall space group symbol | -P 1 |
Residual factor for all reflections | 0.1201 |
Residual factor for significantly intense reflections | 0.0689 |
Weighted residual factors for significantly intense reflections | 0.151 |
Weighted residual factors for all reflections included in the refinement | 0.1867 |
Goodness-of-fit parameter for all reflections included in the refinement | 0.994 |
Diffraction radiation wavelength | 0.71073 Å |
Diffraction radiation type | MoKα |