Information card for entry 7709792
Formula | C20 H24 Br2 Cu2 O23 |
Calculated formula | C20 H24 Br2 Cu2 O23 |
Title of publication | Two-dimensional coordination polymers with high proton conductivity and ultrafast highly efficient molecular sieving constructed by structural inductive effect |
Authors of publication | Zhou, Liang; Ruan, Mingming; Meng, Wei; Wang, Qianping; Liu, Bo; Xuan, Xiaopeng; Zhang, Jun |
Journal of publication | Dalton Transactions |
Year of publication | 2022 |
a | 7.6566 ± 0.0004 Å |
b | 10.5717 ± 0.0005 Å |
c | 10.5825 ± 0.0005 Å |
α | 67.116 ± 0.002° |
β | 89.982 ± 0.002° |
γ | 75.517 ± 0.002° |
Cell volume | 759.56 ± 0.07 Å3 |
Cell temperature | 101 K |
Ambient diffraction temperature | 101 K |
Number of distinct elements | 5 |
Space group number | 2 |
Hermann-Mauguin space group symbol | P -1 |
Hall space group symbol | -P 1 |
Residual factor for all reflections | 0.1087 |
Residual factor for significantly intense reflections | 0.0807 |
Weighted residual factors for significantly intense reflections | 0.1862 |
Weighted residual factors for all reflections included in the refinement | 0.2049 |
Goodness-of-fit parameter for all reflections included in the refinement | 1.085 |
Diffraction radiation probe | x-ray |
Diffraction radiation wavelength | 0.71073 Å |
Diffraction radiation type | MoKα |