Information card for entry 7709793
Formula | C20 H24 Cu2 I2 O23 |
Calculated formula | C20 H24 Cu2 I2 O23 |
Title of publication | Two-dimensional coordination polymers with high proton conductivity and ultrafast highly efficient molecular sieving constructed by structural inductive effect |
Authors of publication | Zhou, Liang; Ruan, Mingming; Meng, Wei; Wang, Qianping; Liu, Bo; Xuan, Xiaopeng; Zhang, Jun |
Journal of publication | Dalton Transactions |
Year of publication | 2022 |
a | 7.6629 ± 0.0006 Å |
b | 10.573 ± 0.0009 Å |
c | 10.5855 ± 0.0009 Å |
α | 67.176 ± 0.003° |
β | 89.856 ± 0.003° |
γ | 75.429 ± 0.003° |
Cell volume | 760.7 ± 0.11 Å3 |
Cell temperature | 101 K |
Ambient diffraction temperature | 101 K |
Number of distinct elements | 5 |
Space group number | 2 |
Hermann-Mauguin space group symbol | P -1 |
Hall space group symbol | -P 1 |
Residual factor for all reflections | 0.1361 |
Residual factor for significantly intense reflections | 0.0967 |
Weighted residual factors for significantly intense reflections | 0.2243 |
Weighted residual factors for all reflections included in the refinement | 0.2498 |
Goodness-of-fit parameter for all reflections included in the refinement | 1.065 |
Diffraction radiation probe | x-ray |
Diffraction radiation wavelength | 0.71073 Å |
Diffraction radiation type | MoKα |