Information card for entry 7709826
Formula |
C108 H116 B4 Cl6 Cu12 F6 N28 O8 S14 W4 |
Calculated formula |
C108 H116 B4 Cl6 Cu12 F6 N28 O8 S14 W4 |
Title of publication |
Construction of cluster-based supramolecular wire and rectangle |
Authors of publication |
Tan, Yi; Wang, Zhi-Kang; Lang, Fei-Fan; Yu, Hui-Min; Chen, Cao; Ni, Chun-Yan; Wang, Meng-Yi; Song, Ying-Lin; Lang, Jian-Ping |
Journal of publication |
Dalton Transactions |
Year of publication |
2022 |
a |
9.8327 ± 0.0007 Å |
b |
16.2223 ± 0.0012 Å |
c |
25.3788 ± 0.0017 Å |
α |
91.961 ± 0.002° |
β |
91.493 ± 0.002° |
γ |
104.795 ± 0.002° |
Cell volume |
3909.1 ± 0.5 Å3 |
Cell temperature |
120.03 K |
Ambient diffraction temperature |
120.03 K |
Number of distinct elements |
10 |
Space group number |
2 |
Hermann-Mauguin space group symbol |
P -1 |
Hall space group symbol |
-P 1 |
Residual factor for all reflections |
0.0748 |
Residual factor for significantly intense reflections |
0.0516 |
Weighted residual factors for significantly intense reflections |
0.1155 |
Weighted residual factors for all reflections included in the refinement |
0.1242 |
Goodness-of-fit parameter for all reflections included in the refinement |
1.036 |
Diffraction radiation wavelength |
0.71073 Å |
Diffraction radiation type |
MoKα |
Yes |
No |
No |