Information card for entry 7709827
Formula |
C113.2 H131.8 B4 Cl8 Cu12 F6 N29.4 O7.4 S14 W4 |
Calculated formula |
C113.2 H131.8 B4 Cl8 Cu12 F6 N29.4 O7.4 S14 W4 |
Title of publication |
Construction of cluster-based supramolecular wire and rectangle |
Authors of publication |
Tan, Yi; Wang, Zhi-Kang; Lang, Fei-Fan; Yu, Hui-Min; Chen, Cao; Ni, Chun-Yan; Wang, Meng-Yi; Song, Ying-Lin; Lang, Jian-Ping |
Journal of publication |
Dalton Transactions |
Year of publication |
2022 |
a |
26.3933 ± 0.001 Å |
b |
26.3933 ± 0.001 Å |
c |
25.7305 ± 0.001 Å |
α |
90° |
β |
90° |
γ |
120° |
Cell volume |
15522.7 ± 1 Å3 |
Cell temperature |
120.01 K |
Ambient diffraction temperature |
120.01 K |
Number of distinct elements |
10 |
Space group number |
147 |
Hermann-Mauguin space group symbol |
P -3 |
Hall space group symbol |
-P 3 |
Residual factor for all reflections |
0.0778 |
Residual factor for significantly intense reflections |
0.0535 |
Weighted residual factors for significantly intense reflections |
0.1346 |
Weighted residual factors for all reflections included in the refinement |
0.1665 |
Goodness-of-fit parameter for all reflections included in the refinement |
1.115 |
Diffraction radiation wavelength |
0.71073 Å |
Diffraction radiation type |
MoKα |
Yes |
Yes |
No |