Information card for entry 7709851
Formula |
C53 H35 Cd2 N7 O9 S2 |
Calculated formula |
C53 H35 Cd2 N7 O9 S2 |
Title of publication |
Turn-on and blue-shift fluorescence sensor toward l-histidine based on stable CdII metal–organic framework with tetranuclear cluster units |
Authors of publication |
Li, Jing; Yao, Shu-Li; Zheng, Teng-Fei; Xu, Hui; Li, Jin-Yan; Peng, Yan; Chen, Jing-Lin; Liu, Sui-Jun; Wen, He-Rui |
Journal of publication |
Dalton Transactions |
Year of publication |
2022 |
a |
10.9662 ± 0.0003 Å |
b |
11.9668 ± 0.0004 Å |
c |
18.1565 ± 0.0006 Å |
α |
104.1 ± 0.001° |
β |
91.271 ± 0.001° |
γ |
97.877 ± 0.001° |
Cell volume |
2285.26 ± 0.12 Å3 |
Cell temperature |
291 K |
Ambient diffraction temperature |
291 K |
Number of distinct elements |
6 |
Space group number |
2 |
Hermann-Mauguin space group symbol |
P -1 |
Hall space group symbol |
-P 1 |
Residual factor for all reflections |
0.0502 |
Residual factor for significantly intense reflections |
0.0307 |
Weighted residual factors for significantly intense reflections |
0.0579 |
Weighted residual factors for all reflections included in the refinement |
0.0646 |
Goodness-of-fit parameter for all reflections included in the refinement |
1.032 |
Diffraction radiation wavelength |
0.71073 Å |
Diffraction radiation type |
MoKα |
Yes |
No |
No |