Information card for entry 7709850
Formula | C25 H26.64 Cd N4 O4 S2 |
Calculated formula | C25 H26.638 Cd N4 O4 S2 |
Title of publication | Insight into charge transportation in cadmium based semiconducting organic–inorganic hybrid materials and their application in the fabrication of photosensitive Schottky devices |
Authors of publication | Roy, Sourav; Dey, Arka; Gomila, Rosa M.; Ortega-Castro, Joaquin; Frontera, Antonio; Ray, Partha Pratim; Chattopadhyay, Shouvik |
Journal of publication | Dalton Transactions |
Year of publication | 2022 |
a | 10.412 ± 0.0013 Å |
b | 23.504 ± 0.003 Å |
c | 11.4415 ± 0.0013 Å |
α | 90° |
β | 99.147 ± 0.004° |
γ | 90° |
Cell volume | 2764.4 ± 0.6 Å3 |
Cell temperature | 293 ± 2 K |
Ambient diffraction temperature | 293 ± 2 K |
Number of distinct elements | 6 |
Space group number | 14 |
Hermann-Mauguin space group symbol | P 1 21/n 1 |
Hall space group symbol | -P 2yn |
Residual factor for all reflections | 0.1313 |
Residual factor for significantly intense reflections | 0.0762 |
Weighted residual factors for significantly intense reflections | 0.1188 |
Weighted residual factors for all reflections included in the refinement | 0.1359 |
Goodness-of-fit parameter for all reflections included in the refinement | 1.107 |
Diffraction radiation wavelength | 0.71073 Å |
Diffraction radiation type | MoKα |