Information card for entry 7710053
Formula | C10 H18 Cu2 I2 S4 |
Calculated formula | C10 H18 Cu2 I2 S4 |
Title of publication | 2,2’-Ethylenebis(1,3-dithiane) as polydentate m2-, m4- and m5-assembling ligand for the construction of sulphur-rich Cu(I), Hg(II) and heterometallic Cu(I)/Hg(II) coordination polymers featuring uncommon network architectures |
Authors of publication | Viau, Lydie; Knorr, Michael; Knauer, Lena; Brieger, Lukas; Strohman, Carsten |
Journal of publication | Dalton Transactions |
Year of publication | 2022 |
a | 6.0654 ± 0.0002 Å |
b | 8.2884 ± 0.0003 Å |
c | 8.4381 ± 0.0003 Å |
α | 88.411 ± 0.002° |
β | 87.976 ± 0.002° |
γ | 86.729 ± 0.002° |
Cell volume | 423.11 ± 0.03 Å3 |
Cell temperature | 100 K |
Ambient diffraction temperature | 100 K |
Number of distinct elements | 5 |
Space group number | 2 |
Hermann-Mauguin space group symbol | P -1 |
Hall space group symbol | -P 1 |
Residual factor for all reflections | 0.0328 |
Residual factor for significantly intense reflections | 0.0257 |
Weighted residual factors for significantly intense reflections | 0.0559 |
Weighted residual factors for all reflections included in the refinement | 0.0592 |
Goodness-of-fit parameter for all reflections included in the refinement | 1.108 |
Diffraction radiation probe | x-ray |
Diffraction radiation wavelength | 0.71073 Å |
Diffraction radiation type | MoKα |