Information card for entry 7710054
Formula | C10 H18 Hg I2 S4 |
Calculated formula | C10 H18 Hg I2 S4 |
Title of publication | 2,2’-Ethylenebis(1,3-dithiane) as polydentate m2-, m4- and m5-assembling ligand for the construction of sulphur-rich Cu(I), Hg(II) and heterometallic Cu(I)/Hg(II) coordination polymers featuring uncommon network architectures |
Authors of publication | Viau, Lydie; Knorr, Michael; Knauer, Lena; Brieger, Lukas; Strohman, Carsten |
Journal of publication | Dalton Transactions |
Year of publication | 2022 |
a | 9.3903 ± 0.0003 Å |
b | 9.8817 ± 0.0003 Å |
c | 10.0545 ± 0.0003 Å |
α | 68.87 ± 0.001° |
β | 79.675 ± 0.001° |
γ | 86.657 ± 0.001° |
Cell volume | 856.14 ± 0.05 Å3 |
Cell temperature | 100 K |
Ambient diffraction temperature | 100 K |
Number of distinct elements | 5 |
Space group number | 2 |
Hermann-Mauguin space group symbol | P -1 |
Hall space group symbol | -P 1 |
Residual factor for all reflections | 0.0244 |
Residual factor for significantly intense reflections | 0.0242 |
Weighted residual factors for significantly intense reflections | 0.059 |
Weighted residual factors for all reflections included in the refinement | 0.0591 |
Goodness-of-fit parameter for all reflections included in the refinement | 1.19 |
Diffraction radiation probe | x-ray |
Diffraction radiation wavelength | 0.71073 Å |
Diffraction radiation type | MoKα |