Information card for entry 7710063
Formula | C10 H18 Br2 Cu2 S4 |
Calculated formula | C10 H18 Br2 Cu2 S4 |
Title of publication | 2,2’-Ethylenebis(1,3-dithiane) as polydentate m2-, m4- and m5-assembling ligand for the construction of sulphur-rich Cu(I), Hg(II) and heterometallic Cu(I)/Hg(II) coordination polymers featuring uncommon network architectures |
Authors of publication | Viau, Lydie; Knorr, Michael; Knauer, Lena; Brieger, Lukas; Strohman, Carsten |
Journal of publication | Dalton Transactions |
Year of publication | 2022 |
a | 8.1301 ± 0.0012 Å |
b | 13.8417 ± 0.0014 Å |
c | 14.591 ± 0.002 Å |
α | 90° |
β | 95.315 ± 0.007° |
γ | 90° |
Cell volume | 1634.9 ± 0.4 Å3 |
Cell temperature | 100 K |
Ambient diffraction temperature | 100 K |
Number of distinct elements | 5 |
Space group number | 14 |
Hermann-Mauguin space group symbol | P 1 21/c 1 |
Hall space group symbol | -P 2ybc |
Residual factor for all reflections | 0.0351 |
Residual factor for significantly intense reflections | 0.0303 |
Weighted residual factors for significantly intense reflections | 0.0721 |
Weighted residual factors for all reflections included in the refinement | 0.074 |
Goodness-of-fit parameter for all reflections included in the refinement | 1.088 |
Diffraction radiation probe | x-ray |
Diffraction radiation wavelength | 0.71073 Å |
Diffraction radiation type | MoKα |