Information card for entry 7710064
Formula
C10 H20 Br4 Hg2 S4
Calculated formula
C10 H20 Br4 Hg2 S4
Title of publication
2,2’-Ethylenebis(1,3-dithiane) as polydentate m2-, m4- and m5-assembling ligand for the construction of sulphur-rich Cu(I), Hg(II) and heterometallic Cu(I)/Hg(II) coordination polymers featuring uncommon network architectures
Authors of publication
Viau, Lydie; Knorr, Michael; Knauer, Lena; Brieger, Lukas; Strohman, Carsten
Journal of publication
Dalton Transactions
Year of publication
2022
a
14.1565 ± 0.0012 Å
b
15.7413 ± 0.0013 Å
c
4.526 ± 0.0003 Å
α
90°
β
90°
γ
90°
Cell volume
1008.58 ± 0.14 Å3
Cell temperature
100 K
Ambient diffraction temperature
100 K
Number of distinct elements
5
Space group number
40
Hermann-Mauguin space group symbol
A m a 2
Hall space group symbol
A 2 -2a
Residual factor for all reflections
0.0196
Residual factor for significantly intense reflections
0.0176
Weighted residual factors for significantly intense reflections
0.0385
Weighted residual factors for all reflections included in the refinement
0.0397
Goodness-of-fit parameter for all reflections included in the refinement
0.969
Diffraction radiation wavelength
0.71073 Å
Diffraction radiation type
MoKα
Yes
Yes
No