Information card for entry 7710595
Formula | C34 H55 B I N2 Si |
Calculated formula | C34 H55 B I N2 Si |
SMILES | IB([Si]1([N](C(C)(C)C)=C(N1C(C)(C)C)c1ccccc1)C(C)(C)C)c1c(cc(cc1C(C)C)C(C)C)C(C)C |
Title of publication | High yield of a variety of silicon-boron radicals and their reactivity |
Authors of publication | Roesky, Herbert W.; Nazish, Mohd; Ding, Yi; Legendre, Christina M.; Kumar, Arun; Graw, Nico; Schwederski, Brigitte; Herbst-Irmer, Regine; P, Parvathy; Parameswaran, Pattiyil; Stalke, Dietmar; Kaim, Wolfgang |
Journal of publication | Dalton Transactions |
Year of publication | 2022 |
a | 12.623 ± 0.002 Å |
b | 19.291 ± 0.003 Å |
c | 14.451 ± 0.002 Å |
α | 90° |
β | 92.06 ± 0.02° |
γ | 90° |
Cell volume | 3516.7 ± 0.9 Å3 |
Cell temperature | 100 ± 2 K |
Ambient diffraction temperature | 100 ± 2 K |
Number of distinct elements | 6 |
Space group number | 14 |
Hermann-Mauguin space group symbol | P 1 21/n 1 |
Hall space group symbol | -P 2yn |
Residual factor for all reflections | 0.0645 |
Residual factor for significantly intense reflections | 0.0392 |
Weighted residual factors for significantly intense reflections | 0.0659 |
Weighted residual factors for all reflections included in the refinement | 0.0733 |
Goodness-of-fit parameter for all reflections included in the refinement | 1.009 |
Diffraction radiation wavelength | 0.71073 Å |
Diffraction radiation type | MoKα |