Information card for entry 7712315
Formula | C33 H29 Cd2 N O12 |
Calculated formula | C33 H29 Cd2 N O12 |
Title of publication | A dual-function [Ru(bpy)<sub>3</sub>]<sup>2+</sup> encapsulated metal organic framework for ratiometric Al<sup>3+</sup> detection and anticounterfeiting application. |
Authors of publication | Li, Huijun; Wang, Yanan; Jiang, Fengjiao; Li, Manman; Xu, Zhouqing |
Journal of publication | Dalton transactions (Cambridge, England : 2003) |
Year of publication | 2023 |
Journal volume | 52 |
Journal issue | 12 |
Pages of publication | 3846 - 3854 |
a | 14.0828 ± 0.0016 Å |
b | 10.9927 ± 0.0012 Å |
c | 23.566 ± 0.003 Å |
α | 90° |
β | 98.544 ± 0.005° |
γ | 90° |
Cell volume | 3607.7 ± 0.7 Å3 |
Cell temperature | 193 K |
Ambient diffraction temperature | 193 K |
Number of distinct elements | 5 |
Space group number | 14 |
Hermann-Mauguin space group symbol | P 1 21/c 1 |
Hall space group symbol | -P 2ybc |
Residual factor for all reflections | 0.0841 |
Residual factor for significantly intense reflections | 0.0708 |
Weighted residual factors for significantly intense reflections | 0.1688 |
Weighted residual factors for all reflections included in the refinement | 0.1762 |
Goodness-of-fit parameter for all reflections included in the refinement | 1.067 |
Diffraction radiation wavelength | 1.34139 Å |
Diffraction radiation type | GaKα |