Information card for entry 7712316
Formula | C10 H8 F6 N O3 P W |
Calculated formula | C10 H8 F6 N O3 P W |
Title of publication | Visible light induced formation of a tungsten hydride complex. |
Authors of publication | Isaacs, Diane P.; Gruninger, Cole T.; Huang, Tao; Jordan, Aldo M.; Nicholas, Genique; Chen, Chun-Hsing; Ter Horst, Marc A.; Dempsey, Jillian L. |
Journal of publication | Dalton transactions (Cambridge, England : 2003) |
Year of publication | 2023 |
a | 11.233 ± 0.0006 Å |
b | 7.7115 ± 0.0004 Å |
c | 16.5205 ± 0.0006 Å |
α | 90° |
β | 91.788 ± 0.001° |
γ | 90° |
Cell volume | 1430.36 ± 0.12 Å3 |
Cell temperature | 150 K |
Ambient diffraction temperature | 150 K |
Number of distinct elements | 7 |
Space group number | 14 |
Hermann-Mauguin space group symbol | P 1 21/n 1 |
Hall space group symbol | -P 2yn |
Residual factor for all reflections | 0.0454 |
Residual factor for significantly intense reflections | 0.0416 |
Weighted residual factors for all reflections | 0.1021 |
Weighted residual factors for significantly intense reflections | 0.1 |
Weighted residual factors for all reflections included in the refinement | 0.1021 |
Goodness-of-fit parameter for all reflections included in the refinement | 1.0106 |
Diffraction radiation wavelength | 0.71073 Å |
Diffraction radiation type | MoKα |