Information card for entry 7712924
Formula | C21 H15 N6 O3 Re S |
Calculated formula | C21 H15 N6 O3 Re S |
Title of publication | Synthesis and the photophysical and biological properties of tricarbonyl Re(I) diimine complexes bound to thiotetrazolato ligands. |
Authors of publication | Stephens, Liam J.; Dallerba, Elena; Kelderman, Jenisi T. A.; Levina, Aviva; Werrett, Melissa V.; Lay, Peter A.; Massi, Massimiliano; Andrews, Philip C. |
Journal of publication | Dalton transactions (Cambridge, England : 2003) |
Year of publication | 2023 |
Journal volume | 52 |
Journal issue | 15 |
Pages of publication | 4835 - 4848 |
a | 19.8643 ± 0.001 Å |
b | 9.4378 ± 0.0003 Å |
c | 11.9223 ± 0.0006 Å |
α | 90° |
β | 104.911 ± 0.005° |
γ | 90° |
Cell volume | 2159.87 ± 0.18 Å3 |
Cell temperature | 123 ± 2 K |
Ambient diffraction temperature | 123 ± 2 K |
Number of distinct elements | 6 |
Space group number | 14 |
Hermann-Mauguin space group symbol | P 1 21/c 1 |
Hall space group symbol | -P 2ybc |
Residual factor for all reflections | 0.0653 |
Residual factor for significantly intense reflections | 0.0451 |
Weighted residual factors for significantly intense reflections | 0.1085 |
Weighted residual factors for all reflections included in the refinement | 0.1194 |
Goodness-of-fit parameter for all reflections included in the refinement | 0.983 |
Diffraction radiation wavelength | 0.71073 Å |
Diffraction radiation type | MoKα |