Information card for entry 7712925
Formula | C25 H25 N6 O4 Re S2 |
Calculated formula | C25 H25 N6 O4 Re S2 |
SMILES | [Re]1(N2C(=S)N(c3c(cc(cc3C)C)C)N=N2)([n]2ccccc2c2[n]1cccc2)(C#[O])(C#[O])C#[O].S(=O)(C)C |
Title of publication | Synthesis and the photophysical and biological properties of tricarbonyl Re(I) diimine complexes bound to thiotetrazolato ligands. |
Authors of publication | Stephens, Liam J.; Dallerba, Elena; Kelderman, Jenisi T. A.; Levina, Aviva; Werrett, Melissa V.; Lay, Peter A.; Massi, Massimiliano; Andrews, Philip C. |
Journal of publication | Dalton transactions (Cambridge, England : 2003) |
Year of publication | 2023 |
Journal volume | 52 |
Journal issue | 15 |
Pages of publication | 4835 - 4848 |
a | 10.1365 ± 0.0002 Å |
b | 11.5551 ± 0.0002 Å |
c | 12.445 ± 0.0003 Å |
α | 77.598 ± 0.002° |
β | 77.198 ± 0.002° |
γ | 88.275 ± 0.002° |
Cell volume | 1388.02 ± 0.05 Å3 |
Cell temperature | 123 ± 2 K |
Ambient diffraction temperature | 123 ± 2 K |
Number of distinct elements | 6 |
Space group number | 2 |
Hermann-Mauguin space group symbol | P -1 |
Hall space group symbol | -P 1 |
Residual factor for all reflections | 0.0312 |
Residual factor for significantly intense reflections | 0.0266 |
Weighted residual factors for significantly intense reflections | 0.0538 |
Weighted residual factors for all reflections included in the refinement | 0.0554 |
Goodness-of-fit parameter for all reflections included in the refinement | 1.008 |
Diffraction radiation wavelength | 0.71073 Å |
Diffraction radiation type | MoKα |