Information card for entry 7713144
Formula | C18 H22 N4 O2 Zn |
Calculated formula | C18 H22 N4 O2 Zn |
Title of publication | Al and Zn phenoxy-amidine complexes for lactide ROP catalysis. |
Authors of publication | Théron, Benjamin; Vaillant-Coindard, Valentin; Balan, Cédric; Rousselin, Yoann; Bayardon, Jérôme; Malacea-Kabbara, Raluca; Le Gendre, Pierre |
Journal of publication | Dalton transactions (Cambridge, England : 2003) |
Year of publication | 2023 |
a | 13.8168 ± 0.0015 Å |
b | 11.5315 ± 0.0013 Å |
c | 11.4556 ± 0.0011 Å |
α | 90° |
β | 110.176 ± 0.003° |
γ | 90° |
Cell volume | 1713.2 ± 0.3 Å3 |
Cell temperature | 100 ± 0.1 K |
Ambient diffraction temperature | 100 ± 0.1 K |
Number of distinct elements | 5 |
Space group number | 15 |
Hermann-Mauguin space group symbol | C 1 2/c 1 |
Hall space group symbol | -C 2yc |
Residual factor for all reflections | 0.0345 |
Residual factor for significantly intense reflections | 0.0253 |
Weighted residual factors for significantly intense reflections | 0.0578 |
Weighted residual factors for all reflections included in the refinement | 0.0616 |
Goodness-of-fit parameter for all reflections included in the refinement | 1.086 |
Diffraction radiation probe | x-ray |
Diffraction radiation wavelength | 0.71073 Å |
Diffraction radiation type | MoKα~1~ |
Diffraction radiation X-ray symbol | K-L~3~ |