Information card for entry 7713145
Formula | C46 H48 N4 O2 Zn2 |
Calculated formula | C46 H48 N4 O2 Zn2 |
Title of publication | Al and Zn phenoxy-amidine complexes for lactide ROP catalysis. |
Authors of publication | Théron, Benjamin; Vaillant-Coindard, Valentin; Balan, Cédric; Rousselin, Yoann; Bayardon, Jérôme; Malacea-Kabbara, Raluca; Le Gendre, Pierre |
Journal of publication | Dalton transactions (Cambridge, England : 2003) |
Year of publication | 2023 |
a | 8.5813 ± 0.0006 Å |
b | 9.6302 ± 0.0007 Å |
c | 12.5497 ± 0.0009 Å |
α | 97.97 ± 0.004° |
β | 99.773 ± 0.004° |
γ | 102.037 ± 0.004° |
Cell volume | 983.15 ± 0.12 Å3 |
Cell temperature | 110 ± 0.1 K |
Ambient diffraction temperature | 110 ± 0.1 K |
Number of distinct elements | 5 |
Space group number | 2 |
Hermann-Mauguin space group symbol | P -1 |
Hall space group symbol | -P 1 |
Residual factor for all reflections | 0.142 |
Residual factor for significantly intense reflections | 0.1186 |
Weighted residual factors for significantly intense reflections | 0.31 |
Weighted residual factors for all reflections included in the refinement | 0.3283 |
Goodness-of-fit parameter for all reflections included in the refinement | 1.069 |
Diffraction radiation probe | x-ray |
Diffraction radiation wavelength | 1.54178 Å |
Diffraction radiation type | CuKα~1~ |
Diffraction radiation X-ray symbol | K-L~3~ |