Information card for entry 7713387
Formula | C81 H102 Cl18 N24 Ni6 S12 |
Calculated formula | C81 H102 Cl18 N24 Ni6 S12 |
Title of publication | Light-induced hydrogen production from water using nickel(II) catalysts and N-doped carbon-dot photosensitizers: catalytic efficiency enhancement by increase of catalyst nuclearity. |
Authors of publication | Gioftsidou, Dimitra K.; Landrou, Georgios; Tzatza, Charikleia; Hatzidimitriou, Antonios; Orfanos, Emmanouil; Charalambidis, Georgios; Ladomenou, Kalliopi; Coutsolelos, Athanassios G.; Angaridis, Panagiotis A. |
Journal of publication | Dalton transactions (Cambridge, England : 2003) |
Year of publication | 2023 |
a | 18.2867 ± 0.001 Å |
b | 18.2867 ± 0.001 Å |
c | 32.7273 ± 0.0019 Å |
α | 90° |
β | 90° |
γ | 120° |
Cell volume | 9477.9 ± 0.9 Å3 |
Cell temperature | 295 K |
Ambient diffraction temperature | 295 K |
Number of distinct elements | 6 |
Space group number | 148 |
Hermann-Mauguin space group symbol | R -3 :H |
Hall space group symbol | -R 3 |
Residual factor for all reflections | 0.077 |
Residual factor for significantly intense reflections | 0.0594 |
Weighted residual factors for all reflections | 0.1357 |
Weighted residual factors for significantly intense reflections | 0.1308 |
Weighted residual factors for all reflections included in the refinement | 0.1308 |
Goodness-of-fit parameter for all reflections included in the refinement | 0.9998 |
Diffraction radiation wavelength | 0.71073 Å |
Diffraction radiation type | MoKα |