Information card for entry 7713388
Formula | C89 H61.5 F24 N28.5 Ni4 S8 |
Calculated formula | C89 H61.5 F24 N28.5 Ni4 S8 |
Title of publication | Light-induced hydrogen production from water using nickel(II) catalysts and N-doped carbon-dot photosensitizers: catalytic efficiency enhancement by increase of catalyst nuclearity. |
Authors of publication | Gioftsidou, Dimitra K.; Landrou, Georgios; Tzatza, Charikleia; Hatzidimitriou, Antonios; Orfanos, Emmanouil; Charalambidis, Georgios; Ladomenou, Kalliopi; Coutsolelos, Athanassios G.; Angaridis, Panagiotis A. |
Journal of publication | Dalton transactions (Cambridge, England : 2003) |
Year of publication | 2023 |
a | 38.267 ± 0.006 Å |
b | 14.165 ± 0.002 Å |
c | 20.809 ± 0.003 Å |
α | 90° |
β | 110.325 ± 0.004° |
γ | 90° |
Cell volume | 10577 ± 3 Å3 |
Cell temperature | 295 K |
Ambient diffraction temperature | 295 K |
Number of distinct elements | 6 |
Space group number | 15 |
Hermann-Mauguin space group symbol | C 1 2/c 1 |
Hall space group symbol | -C 2yc |
Residual factor for all reflections | 0.0859 |
Residual factor for significantly intense reflections | 0.0587 |
Weighted residual factors for all reflections | 0.0917 |
Weighted residual factors for significantly intense reflections | 0.0877 |
Weighted residual factors for all reflections included in the refinement | 0.0877 |
Goodness-of-fit parameter for all reflections included in the refinement | 1 |
Diffraction radiation wavelength | 0.71073 Å |
Diffraction radiation type | MoKα |