Information card for entry 7713389
Formula | C47 H58 F18 N14 Ni2 O2 S6 |
Calculated formula | C47 H58 F18 N14 Ni2 O2 S6 |
Title of publication | Light-induced hydrogen production from water using nickel(II) catalysts and N-doped carbon-dot photosensitizers: catalytic efficiency enhancement by increase of catalyst nuclearity. |
Authors of publication | Gioftsidou, Dimitra K.; Landrou, Georgios; Tzatza, Charikleia; Hatzidimitriou, Antonios; Orfanos, Emmanouil; Charalambidis, Georgios; Ladomenou, Kalliopi; Coutsolelos, Athanassios G.; Angaridis, Panagiotis A. |
Journal of publication | Dalton transactions (Cambridge, England : 2003) |
Year of publication | 2023 |
a | 20.132 ± 0.002 Å |
b | 11.9175 ± 0.0016 Å |
c | 28.727 ± 0.004 Å |
α | 90° |
β | 90° |
γ | 90° |
Cell volume | 6892.3 ± 1.5 Å3 |
Cell temperature | 296 K |
Ambient diffraction temperature | 296 K |
Number of distinct elements | 7 |
Space group number | 61 |
Hermann-Mauguin space group symbol | P b c a |
Hall space group symbol | -P 2ac 2ab |
Residual factor for all reflections | 0.0754 |
Residual factor for significantly intense reflections | 0.0558 |
Weighted residual factors for all reflections | 0.0839 |
Weighted residual factors for significantly intense reflections | 0.0823 |
Weighted residual factors for all reflections included in the refinement | 0.0823 |
Goodness-of-fit parameter for all reflections included in the refinement | 1.0001 |
Diffraction radiation wavelength | 0.71073 Å |
Diffraction radiation type | MoKα |