Information card for entry 9004602
Mineral name |
Meionite |
Formula |
C0.44 Al4.88 Ca2.68 Cl0.07 F0.03 K0.2 Na1.12 O25.32 Si7.12 |
Calculated formula |
C0.44 Al4.88 Ca2.68 Cl0.07 F0.03 K0.2 Na1.12 O25.32 Si7.12 |
Title of publication |
Meionite: Rietveld structure-refinement, Si MAS and Al SATRAS NMR spectroscopy, and comments on the marialite-meionite series Note: sample BOLT |
Authors of publication |
Sherriff, B. L.; Sokolova, E. V.; Kabalov, Y. K.; Jenkins, D. M.; Kunath-Fandrei G; Goetz, S.; Jager, C.; Schneider, J. |
Journal of publication |
The Canadian Mineralogist |
Year of publication |
2000 |
Journal volume |
38 |
Pages of publication |
1201 - 1213 |
a |
12.1476 Å |
b |
12.1476 Å |
c |
7.5636 Å |
α |
90° |
β |
90° |
γ |
90° |
Cell volume |
1116.12 Å3 |
Number of distinct elements |
9 |
Space group number |
87 |
Hermann-Mauguin space group symbol |
I 4/m |
Hall space group symbol |
-I 4 |
Yes |
No |
No |