Information card for entry 9004603
Mineral name |
Meionite |
Formula |
C0.32 Al5.2 Ca3.12 Cl0.01 K0.04 Na0.76 O25.28 S0.16 Si6.8 |
Calculated formula |
C0.32 Al5.2 Ca3.12 Cl0.01 K0.04 Na0.76 O25.28 S0.16 Si6.8 |
Title of publication |
Meionite: Rietveld structure-refinement, Si MAS and Al SATRAS NMR spectroscopy, and comments on the marialite-meionite series Note: sample SL-1 |
Authors of publication |
Sherriff, B. L.; Sokolova, E. V.; Kabalov, Y. K.; Jenkins, D. M.; Kunath-Fandrei G; Goetz, S.; Jager, C.; Schneider, J. |
Journal of publication |
The Canadian Mineralogist |
Year of publication |
2000 |
Journal volume |
38 |
Pages of publication |
1201 - 1213 |
a |
12.1637 Å |
b |
12.1637 Å |
c |
7.5739 Å |
α |
90° |
β |
90° |
γ |
90° |
Cell volume |
1120.6 Å3 |
Number of distinct elements |
9 |
Space group number |
87 |
Hermann-Mauguin space group symbol |
I 4/m |
Hall space group symbol |
-I 4 |
Yes |
No |
No |