Information card for entry 9017838
Mineral name |
Vigrishinite |
Formula |
Ba0.04 Ca0.12 Fe0.36 H1.6 K0.16 Mg0.14 Mn0.44 Na0.46 Nb0.82 O41.42 Si8 Ti5.32 Zn2.62 Zr0.24 |
Calculated formula |
Ba0.04 Ca0.12 Fe0.36 H1.6 K0.16 Mg0.14 Mn0.44 Na0.46 Nb0.82 O41.42 Si8 Ti5.32 Zn2.62 Zr0.24 |
Title of publication |
Vigrishinite, Zn2Ti4-xSi4O14(OH,H2O,[_])8, a new mineral from Lovozero alkaline massif (Kola Peninsula, Russia) |
Authors of publication |
Pekov, I. V.; Britvin, S. N.; Zubkova, N. V.; Chukanov, N. V.; Bryzfalov, I. A.; Lykova, I. S.; Belakovskiy, D. I.; Pushcharovsky, D. Y. |
Journal of publication |
Zapiski Rossiiskogo Mineralogicheskogo Obshchetstva |
Year of publication |
2012 |
Journal volume |
141 |
Pages of publication |
12 - 27 |
a |
8.743 Å |
b |
8.698 Å |
c |
11.581 Å |
α |
91.54° |
β |
98.29° |
γ |
105.65° |
Cell volume |
837.184 Å3 |
Number of distinct elements |
14 |
Space group number |
2 |
Hermann-Mauguin space group symbol |
P -1 |
Hall space group symbol |
-P 1 |
Yes |
No |
No |