Information card for entry 9017839
Mineral name |
Steklite |
Formula |
Al0.89 Fe0.11 K O8 S2 |
Calculated formula |
Al0.89 Fe0.11 K O8 S2 |
Title of publication |
Steklite, KAl(SO4)2: the find at Tolbachik volcano (Kamchatka, Russia). Validation as a mineral species and crystal structure |
Authors of publication |
Murashko, M. N.; Pekov, I. V.; Krivovichev, S. V.; Chernyatyeava, A. P.; Yapaskurt, V. O.; Zadov, A. E.; Zelensky, M. E. |
Journal of publication |
Zapiski Rossiiskogo Mineralogicheskogo Obshchetstva |
Year of publication |
2012 |
Journal volume |
141 |
Pages of publication |
36 - 44 |
a |
4.7281 Å |
b |
4.7281 Å |
c |
7.9936 Å |
α |
90° |
β |
90° |
γ |
120° |
Cell volume |
154.756 Å3 |
Number of distinct elements |
5 |
Space group number |
149 |
Hermann-Mauguin space group symbol |
P 3 1 2 |
Hall space group symbol |
P 3 2 |
Yes |
No |
No |