Information card for entry 4001964
Formula | C72 H52 Cl12 N2 O8 |
Calculated formula | C72 H50 Cl12 N2 O8 |
SMILES | ClC(Cl)Cl.ClC(Cl)Cl.ClC(Cl)Cl.ClC(Cl)Cl.COc1ccc(cc1)c1c2c(c(c3c1C(=O)N(C3=O)CCCCN1C(=O)c3c(C1=O)c(c1ccc(cc1)OC)c1c(c3c3ccc(cc3)OC)c3cccc4c3c1ccc4)c1ccc(cc1)OC)c1c3c2cccc3ccc1 |
Title of publication | Alkylene-Chain Effect on Microwire Growth and Crystal Packing of π-Moieties |
Authors of publication | Ding, Lin; Li, Hai-Bin; Lei, Ting; Ying, Han-Ze; Wang, Rui-Bo; Zhou, Yan; Su, Zhong-Min; Pei, Jian |
Journal of publication | Chemistry of Materials |
Year of publication | 2012 |
Journal volume | 24 |
Journal issue | 10 |
Pages of publication | 1944 |
a | 14.759 ± 0.004 Å |
b | 22.637 ± 0.006 Å |
c | 10.135 ± 0.003 Å |
α | 90° |
β | 94.415 ± 0.004° |
γ | 90° |
Cell volume | 3376.1 ± 1.6 Å3 |
Cell temperature | 113 ± 2 K |
Ambient diffraction temperature | 113 ± 2 K |
Number of distinct elements | 5 |
Space group number | 14 |
Hermann-Mauguin space group symbol | P 1 21/c 1 |
Hall space group symbol | -P 2ybc |
Residual factor for all reflections | 0.0997 |
Residual factor for significantly intense reflections | 0.0888 |
Weighted residual factors for significantly intense reflections | 0.2489 |
Weighted residual factors for all reflections included in the refinement | 0.2612 |
Goodness-of-fit parameter for all reflections included in the refinement | 1.035 |
Diffraction radiation wavelength | 0.71073 Å |
Diffraction radiation type | MoKα |