Information card for entry 4023281
Formula | C25 H22 N2 O8 |
Calculated formula | C25 H22 N2 O8 |
Title of publication | Rh-Catalyzed Formation of Dioxolanes from α-Alkyl Diazoesters: Diastereoselective Cycloadditions of Carbonyl Ylides with Selectivity over β-Hydride Elimination |
Authors of publication | Andrew DeAngelis; Patricia Panne; Glenn P. A. Yap; Joseph M. Fox |
Journal of publication | Journal of Organic Chemistry |
Year of publication | 2008 |
Journal volume | 73 |
Pages of publication | 1435 - 1439 |
a | 8.9876 ± 0.0015 Å |
b | 10.2457 ± 0.0017 Å |
c | 25.218 ± 0.004 Å |
α | 90° |
β | 99.813 ± 0.002° |
γ | 90° |
Cell volume | 2288.2 ± 0.6 Å3 |
Cell temperature | 170 ± 2 K |
Ambient diffraction temperature | 170 ± 2 K |
Number of distinct elements | 4 |
Space group number | 14 |
Hermann-Mauguin space group symbol | P 1 21/c 1 |
Hall space group symbol | -P 2ybc |
Residual factor for all reflections | 0.0529 |
Residual factor for significantly intense reflections | 0.048 |
Weighted residual factors for significantly intense reflections | 0.1361 |
Weighted residual factors for all reflections included in the refinement | 0.1428 |
Goodness-of-fit parameter for all reflections included in the refinement | 1.016 |
Diffraction radiation wavelength | 0.71073 Å |
Diffraction radiation type | MoKα |