Information card for entry 4132283
Formula | C66 H126 Cl2 P2 Pt |
Calculated formula | C66 H126 Cl2 P2 Pt |
Title of publication | Three-Fold Intramolecular Ring Closing Alkene Metatheses of Square Planar Complexes with cis Phosphorus Donor Ligands P(X(CH<sub>2</sub>) <sub>m</sub>CH═CH<sub>2</sub>)<sub>3</sub> (X = -, m = 5-10; X = O, m = 3-5): Syntheses, Structures, and Thermal Properties of Macrocyclic Dibridgehead Diphosphorus Complexes. |
Authors of publication | Joshi, Hemant; Kharel, Sugam; Ehnbom, Andreas; Skopek, Katrin; Hess, Gisela D.; Fiedler, Tobias; Hampel, Frank; Bhuvanesh, Nattamai; Gladysz, John A. |
Journal of publication | Journal of the American Chemical Society |
Year of publication | 2018 |
Journal volume | 140 |
Journal issue | 27 |
Pages of publication | 8463 - 8478 |
a | 24.469 ± 0.002 Å |
b | 13.88 ± 0.0012 Å |
c | 20.2636 ± 0.0018 Å |
α | 90° |
β | 95.492 ± 0.005° |
γ | 90° |
Cell volume | 6850.5 ± 1 Å3 |
Cell temperature | 100 K |
Ambient diffraction temperature | 100 K |
Number of distinct elements | 5 |
Space group number | 14 |
Hermann-Mauguin space group symbol | P 1 21/c 1 |
Hall space group symbol | -P 2ybc |
Residual factor for all reflections | 0.0712 |
Residual factor for significantly intense reflections | 0.055 |
Weighted residual factors for significantly intense reflections | 0.1128 |
Weighted residual factors for all reflections included in the refinement | 0.126 |
Goodness-of-fit parameter for all reflections included in the refinement | 1.127 |
Diffraction radiation wavelength | 1.54178 Å |
Diffraction radiation type | CuKα |