Information card for entry 4306471
Formula | C100 H86 N12 O28 Zn5 |
Calculated formula | C100 H86 N12 O28 Zn5 |
Title of publication | Self-Assembly of 2D\ρightarrow2D Interpenetrating Coordination Polymers Showing Polyrotaxane- and Polycatenane-like Motifs: Influence of Various Ligands on Topological Structural Diversity |
Authors of publication | Ya-Qian Lan; Shun-Li Li; Jun-Sheng Qin; Dong-Ying Du; Xin-Long Wang; Zhong-Min Su; Qiang Fu |
Journal of publication | Inorganic Chemistry |
Year of publication | 2008 |
Journal volume | 47 |
Pages of publication | 10600 - 10610 |
a | 11.589 ± 0.0004 Å |
b | 11.773 ± 0.0004 Å |
c | 19.69 ± 0.0007 Å |
α | 94.484 ± 0.001° |
β | 105.29 ± 0.001° |
γ | 114.167 ± 0.001° |
Cell volume | 2310.75 ± 0.14 Å3 |
Cell temperature | 293 ± 2 K |
Ambient diffraction temperature | 293 ± 2 K |
Number of distinct elements | 5 |
Space group number | 2 |
Hermann-Mauguin space group symbol | P -1 |
Hall space group symbol | -P 1 |
Residual factor for all reflections | 0.0878 |
Residual factor for significantly intense reflections | 0.05 |
Weighted residual factors for significantly intense reflections | 0.1212 |
Weighted residual factors for all reflections included in the refinement | 0.1423 |
Goodness-of-fit parameter for all reflections included in the refinement | 1.031 |
Diffraction radiation wavelength | 0.71069 Å |
Diffraction radiation type | MoKα |