Information card for entry 4306802
Formula | C44 H34 Mn N10 O3 W |
Calculated formula | C44 H32 Mn N10 O3 W |
Title of publication | Intermolecular Contact-Tuned Magnetic Nature in One-Dimensional 3d-5d Bimetallic Systems: From a Metamagnet to a Single-Chain Magnet |
Authors of publication | Seok Woo Choi; Hyun Young Kwak; Jung Hee Yoon; Hyoung Chan Kim; Eui Kwan Koh; Chang Seop Hong |
Journal of publication | Inorganic Chemistry |
Year of publication | 2008 |
Journal volume | 47 |
Pages of publication | 10214 - 10216 |
a | 39.3224 ± 0.0008 Å |
b | 10.6638 ± 0.0002 Å |
c | 22.0184 ± 0.0005 Å |
α | 90° |
β | 121.607 ± 0.001° |
γ | 90° |
Cell volume | 7863.3 ± 0.3 Å3 |
Cell temperature | 293 ± 2 K |
Ambient diffraction temperature | 293 ± 2 K |
Number of distinct elements | 6 |
Space group number | 15 |
Hermann-Mauguin space group symbol | C 1 2/c 1 |
Hall space group symbol | -C 2yc |
Residual factor for all reflections | 0.0675 |
Residual factor for significantly intense reflections | 0.0377 |
Weighted residual factors for significantly intense reflections | 0.0721 |
Weighted residual factors for all reflections included in the refinement | 0.0816 |
Goodness-of-fit parameter for all reflections included in the refinement | 1.009 |
Diffraction radiation wavelength | 0.71073 Å |
Diffraction radiation type | MoKα |