Information card for entry 4342903
Formula | C26 H26 F3 N2 O3.5 S Te |
Calculated formula | C26 H26 F3 N2 O3.5 S Te |
Title of publication | Te(II)/Te(IV) Mediated C-N Bond Formation on 2,5-Diphenyltellurophene and a Reassignment of the Product from the Reaction of PhI(OAc)2 with 2 TMS-OTf. |
Authors of publication | Aprile, Antonino; Iversen, Kalon J.; Wilson, David J. D.; Dutton, Jason L. |
Journal of publication | Inorganic chemistry |
Year of publication | 2015 |
Journal volume | 54 |
Journal issue | 10 |
Pages of publication | 4934 - 4939 |
a | 14.3566 ± 0.0007 Å |
b | 10.5736 ± 0.0006 Å |
c | 35.4072 ± 0.0017 Å |
α | 90° |
β | 92.06 ± 0.004° |
γ | 90° |
Cell volume | 5371.4 ± 0.5 Å3 |
Cell temperature | 173 ± 2 K |
Ambient diffraction temperature | 173 ± 2 K |
Number of distinct elements | 7 |
Space group number | 15 |
Hermann-Mauguin space group symbol | I 1 2/c 1 |
Hall space group symbol | -I 2yc |
Residual factor for all reflections | 0.0428 |
Residual factor for significantly intense reflections | 0.0338 |
Weighted residual factors for significantly intense reflections | 0.0848 |
Weighted residual factors for all reflections included in the refinement | 0.0924 |
Goodness-of-fit parameter for all reflections included in the refinement | 1.046 |
Diffraction radiation wavelength | 0.71073 Å |
Diffraction radiation type | MoKα |