Information card for entry 4343077
Formula | C123 H121 Fe2 K2 N11 O16 U |
Calculated formula | C123 H121 Fe2 K2 N11 O16 U |
Title of publication | Ferrocene-Based Tetradentate Schiff Bases as Supporting Ligands in Uranium Chemistry. |
Authors of publication | Camp, Clément; Chatelain, Lucile; Mougel, Victor; Pécaut, Jacques; Mazzanti, Marinella |
Journal of publication | Inorganic chemistry |
Year of publication | 2015 |
Journal volume | 54 |
Journal issue | 12 |
Pages of publication | 5774 - 5783 |
a | 14.547 ± 0.0005 Å |
b | 15.1229 ± 0.0005 Å |
c | 15.6904 ± 0.0005 Å |
α | 111.275 ± 0.003° |
β | 109.039 ± 0.003° |
γ | 105.703 ± 0.003° |
Cell volume | 2728 ± 0.2 Å3 |
Cell temperature | 150 ± 2 K |
Ambient diffraction temperature | 150 ± 2 K |
Number of distinct elements | 7 |
Space group number | 2 |
Hermann-Mauguin space group symbol | P -1 |
Hall space group symbol | -P 1 |
Residual factor for all reflections | 0.1151 |
Residual factor for significantly intense reflections | 0.0633 |
Weighted residual factors for significantly intense reflections | 0.1285 |
Weighted residual factors for all reflections included in the refinement | 0.1499 |
Goodness-of-fit parameter for all reflections included in the refinement | 1.04 |
Diffraction radiation wavelength | 0.71073 Å |
Diffraction radiation type | MoKα |