Information card for entry 4343078
Formula | C184 H250 Fe4 K6 N8 O45 U2 |
Calculated formula | C184 H250 Fe4 K6 N8 O45 U2 |
Title of publication | Ferrocene-Based Tetradentate Schiff Bases as Supporting Ligands in Uranium Chemistry. |
Authors of publication | Camp, Clément; Chatelain, Lucile; Mougel, Victor; Pécaut, Jacques; Mazzanti, Marinella |
Journal of publication | Inorganic chemistry |
Year of publication | 2015 |
Journal volume | 54 |
Journal issue | 12 |
Pages of publication | 5774 - 5783 |
a | 14.1711 ± 0.0011 Å |
b | 14.3703 ± 0.0008 Å |
c | 23.1519 ± 0.0014 Å |
α | 100.57 ± 0.005° |
β | 98.893 ± 0.006° |
γ | 90.667 ± 0.005° |
Cell volume | 4575.1 ± 0.5 Å3 |
Cell temperature | 150 ± 2 K |
Ambient diffraction temperature | 150 ± 2 K |
Number of distinct elements | 7 |
Space group number | 2 |
Hermann-Mauguin space group symbol | P -1 |
Hall space group symbol | -P 1 |
Residual factor for all reflections | 0.0793 |
Residual factor for significantly intense reflections | 0.0517 |
Weighted residual factors for significantly intense reflections | 0.1034 |
Weighted residual factors for all reflections included in the refinement | 0.1151 |
Goodness-of-fit parameter for all reflections included in the refinement | 1.043 |
Diffraction radiation wavelength | 0.71073 Å |
Diffraction radiation type | MoKα |