Information card for entry 4343207
Formula | C49 H27 Eu F18 O8 P2 |
Calculated formula | C49 H27 Eu F18 O8 P2 |
Title of publication | Luminescent Coordination Glass: Remarkable Morphological Strategy for Assembled Eu(III) Complexes. |
Authors of publication | Hirai, Yuichi; Nakanishi, Takayuki; Kitagawa, Yuichi; Fushimi, Koji; Seki, Tomohiro; Ito, Hajime; Fueno, Hiroyuki; Tanaka, Kazuyoshi; Satoh, Toshifumi; Hasegawa, Yasuchika |
Journal of publication | Inorganic chemistry |
Year of publication | 2015 |
Journal volume | 54 |
Journal issue | 9 |
Pages of publication | 4364 - 4370 |
a | 23.1941 ± 0.001 Å |
b | 13.4114 ± 0.0005 Å |
c | 16.7226 ± 0.0006 Å |
α | 90° |
β | 91.6148 ± 0.001° |
γ | 90° |
Cell volume | 5199.8 ± 0.4 Å3 |
Cell temperature | 123 K |
Ambient diffraction temperature | 123 K |
Number of distinct elements | 6 |
Space group number | 14 |
Hermann-Mauguin space group symbol | P 1 21/c 1 |
Hall space group symbol | -P 2ybc |
Residual factor for all reflections | 0.0484 |
Residual factor for significantly intense reflections | 0.042 |
Weighted residual factors for significantly intense reflections | 0.0989 |
Weighted residual factors for all reflections included in the refinement | 0.0998 |
Goodness-of-fit parameter for all reflections included in the refinement | 2.865 |
Diffraction radiation wavelength | 0.71075 Å |
Diffraction radiation type | MoKα |