Information card for entry 4343208
Formula |
C98 H54 Eu2 F36 O16 P4 |
Calculated formula |
C98 H54 Eu2 F36 O16 P4 |
Title of publication |
Luminescent Coordination Glass: Remarkable Morphological Strategy for Assembled Eu(III) Complexes. |
Authors of publication |
Hirai, Yuichi; Nakanishi, Takayuki; Kitagawa, Yuichi; Fushimi, Koji; Seki, Tomohiro; Ito, Hajime; Fueno, Hiroyuki; Tanaka, Kazuyoshi; Satoh, Toshifumi; Hasegawa, Yasuchika |
Journal of publication |
Inorganic chemistry |
Year of publication |
2015 |
Journal volume |
54 |
Journal issue |
9 |
Pages of publication |
4364 - 4370 |
a |
12.5432 ± 0.0009 Å |
b |
30.3644 ± 0.0015 Å |
c |
12.9212 ± 0.0009 Å |
α |
90° |
β |
90.378 ± 0.006° |
γ |
90° |
Cell volume |
4921.1 ± 0.5 Å3 |
Cell temperature |
296 K |
Ambient diffraction temperature |
296 K |
Number of distinct elements |
6 |
Space group number |
14 |
Hermann-Mauguin space group symbol |
P 1 21/n 1 |
Hall space group symbol |
-P 2yn |
Residual factor for significantly intense reflections |
0.0439 |
Weighted residual factors for all reflections included in the refinement |
0.0728 |
Goodness-of-fit parameter for all reflections included in the refinement |
1.008 |
Diffraction radiation wavelength |
0.71075 Å |
Diffraction radiation type |
MoKα |
Yes |
No |
No |