Information card for entry 4516602
Formula | C35 H39 N3 O11 Zn2 |
Calculated formula | C35 H39 N3 O11 Zn2 |
Title of publication | Solvothermal Metal Metathesis on a Metal-Organic Framework with Constricted Pores and the Study of Gas Separation. |
Authors of publication | Li, Liangjun; Xue, Haitao; Wang, Ying; Zhao, Pinhui; Zhu, Dandan; Jiang, Min; Zhao, Xuebo |
Journal of publication | ACS applied materials & interfaces |
Year of publication | 2015 |
Journal volume | 7 |
Journal issue | 45 |
Pages of publication | 25402 - 25412 |
a | 14.7776 ± 0.0013 Å |
b | 12.4094 ± 0.0011 Å |
c | 29.9554 ± 0.0018 Å |
α | 90° |
β | 115.572 ± 0.003° |
γ | 90° |
Cell volume | 4955.2 ± 0.7 Å3 |
Cell temperature | 293 ± 2 K |
Ambient diffraction temperature | 293 ± 2 K |
Number of distinct elements | 5 |
Space group number | 14 |
Hermann-Mauguin space group symbol | P 1 21/c 1 |
Hall space group symbol | -P 2ybc |
Residual factor for all reflections | 0.0591 |
Residual factor for significantly intense reflections | 0.0463 |
Weighted residual factors for significantly intense reflections | 0.1357 |
Weighted residual factors for all reflections included in the refinement | 0.1428 |
Goodness-of-fit parameter for all reflections included in the refinement | 1.042 |
Diffraction radiation wavelength | 0.71073 Å |
Diffraction radiation type | MoKα |