Information card for entry 4518011
Formula | C39 H72 N15 P3 |
Calculated formula | C39 H72 N15 P3 |
Title of publication | Synthesis of Tris-Phosphazene Bases with Triazine as Core and Their Applications for Efficient Ring-Opening Alternating Copolymerization of Epoxide and Anhydride: Notable Effect of Basicity and Molecular Size |
Authors of publication | Wang, Lebin; Zhang, Jinbo; Zhao, Na; Ren, Chuanli; Liu, Shaofeng; Li, Zhibo |
Journal of publication | ACS Macro Letters |
Year of publication | 2020 |
Journal volume | 9 |
Journal issue | 9 |
Pages of publication | 1398 - 1402 |
a | 19.771 ± 0.009 Å |
b | 13.978 ± 0.006 Å |
c | 16.975 ± 0.008 Å |
α | 90° |
β | 90.001° |
γ | 90° |
Cell volume | 4691 ± 4 Å3 |
Cell temperature | 100 ± 2 K |
Ambient diffraction temperature | 100 ± 2 K |
Number of distinct elements | 4 |
Space group number | 14 |
Hermann-Mauguin space group symbol | P 1 21/c 1 |
Hall space group symbol | -P 2ybc |
Residual factor for all reflections | 0.139 |
Residual factor for significantly intense reflections | 0.074 |
Weighted residual factors for significantly intense reflections | 0.1811 |
Weighted residual factors for all reflections included in the refinement | 0.2069 |
Goodness-of-fit parameter for all reflections included in the refinement | 0.88 |
Diffraction radiation wavelength | 0.71073 Å |
Diffraction radiation type | MoKα |