Information card for entry 7009474
Formula | C47.5 H66 N8 O4 Sb4 |
Calculated formula | C47.5 H60 N8 O4 Sb4 |
Title of publication | Reactions of the spiro monoanion [{(Me2N)Sb(μ-NCy)2}2Sb]− with alcohols and thiols (REH; E = O or S); syntheses of nido-[Sb3(μ-NCy)3(μ3-NCy)(ER)2] anions and the unique antimony(III) imido cubane [(2-NC5H4O)Sb(μ3-NCy)]4 (Cy= cyclohexyl) |
Authors of publication | Bashall, Alan; Beswick, Michael A.; Feeder, Neil; Hopkins, Alexander D.; Kidd, Sara J.; McPartlin, Mary; Raithby, Paul R.; Wright, Dominic S. |
Journal of publication | Journal of the Chemical Society, Dalton Transactions |
Year of publication | 2000 |
Journal issue | 12 |
Pages of publication | 1841 |
a | 12.793 ± 0.003 Å |
b | 14.864 ± 0.003 Å |
c | 15.34 ± 0.003 Å |
α | 65.45 ± 0.03° |
β | 74.73 ± 0.03° |
γ | 80.35 ± 0.03° |
Cell volume | 2554 ± 1.2 Å3 |
Cell temperature | 180 ± 2 K |
Ambient diffraction temperature | 180 ± 2 K |
Number of distinct elements | 5 |
Space group number | 2 |
Hermann-Mauguin space group symbol | P -1 |
Hall space group symbol | -P 1 |
Residual factor for all reflections | 0.0862 |
Residual factor for significantly intense reflections | 0.0439 |
Weighted residual factors for significantly intense reflections | 0.0961 |
Weighted residual factors for all reflections included in the refinement | 0.1316 |
Goodness-of-fit parameter for all reflections included in the refinement | 1.026 |
Diffraction radiation wavelength | 0.71073 Å |
Diffraction radiation type | MoKα |