Information card for entry 7015137
Formula | C38 H72 N4 Si4 Y |
Calculated formula | C38 H65 N4 Si4 Y |
Title of publication | Rare earth metal bis(amide) complexes bearing amidinate ancillary ligands: synthesis, characterization, and performance as catalyst precursors for cis-1,4 selective polymerization of isoprene. |
Authors of publication | Luo, Yunjie; Fan, Shimin; Yang, Jianping; Fang, Jianghua; Xu, Ping |
Journal of publication | Dalton transactions (Cambridge, England : 2003) |
Year of publication | 2011 |
Journal volume | 40 |
Journal issue | 12 |
Pages of publication | 3053 - 3059 |
a | 12.393 ± 0.006 Å |
b | 13.632 ± 0.008 Å |
c | 15.539 ± 0.008 Å |
α | 104.788 ± 0.014° |
β | 108.411 ± 0.006° |
γ | 100.221 ± 0.013° |
Cell volume | 2311 ± 2 Å3 |
Cell temperature | 293 ± 2 K |
Ambient diffraction temperature | 293 ± 2 K |
Number of distinct elements | 5 |
Space group number | 2 |
Hermann-Mauguin space group symbol | P -1 |
Hall space group symbol | -P 1 |
Residual factor for all reflections | 0.1043 |
Residual factor for significantly intense reflections | 0.079 |
Weighted residual factors for significantly intense reflections | 0.1641 |
Weighted residual factors for all reflections included in the refinement | 0.1781 |
Goodness-of-fit parameter for all reflections included in the refinement | 1.117 |
Diffraction radiation wavelength | 0.7107 Å |
Diffraction radiation type | MoKα |