Information card for entry 7033752
Formula | C57.5 H8 B2 Cl6 F34 Fe N6 O6 S6 |
Calculated formula | C57.5 H8 B2 Cl6 F34 Fe N6 O6 S6 |
Title of publication | Molecular design of cage iron(ii) and cobalt(ii,iii) complexes with a second fluorine-enriched superhydrophobic shell. |
Authors of publication | Belov, Alexander S.; Zelinskii, Genrikh E.; Varzatskii, Oleg A.; Belaya, Irina G.; Vologzhanina, Anna V.; Dolganov, Alexander V.; Novikov, Valentin V.; Voloshin, Yan Z. |
Journal of publication | Dalton transactions (Cambridge, England : 2003) |
Year of publication | 2015 |
Journal volume | 44 |
Journal issue | 8 |
Pages of publication | 3773 - 3784 |
a | 29.188 ± 0.019 Å |
b | 8.114 ± 0.005 Å |
c | 30.93 ± 0.02 Å |
α | 90° |
β | 101.479 ± 0.012° |
γ | 90° |
Cell volume | 7179 ± 8 Å3 |
Cell temperature | 100 K |
Ambient diffraction temperature | 100 K |
Number of distinct elements | 9 |
Space group number | 15 |
Hermann-Mauguin space group symbol | C 1 2/c 1 |
Hall space group symbol | -C 2yc |
Residual factor for all reflections | 0.1593 |
Residual factor for significantly intense reflections | 0.0748 |
Weighted residual factors for significantly intense reflections | 0.1259 |
Weighted residual factors for all reflections included in the refinement | 0.1499 |
Goodness-of-fit parameter for all reflections included in the refinement | 1.003 |
Diffraction radiation wavelength | 0.71073 Å |
Diffraction radiation type | MoKα |