Information card for entry 7033956
Formula | C71 H113 N4 O3 Y2 |
Calculated formula | C71 H113 N4 O3 Y2 |
Title of publication | Metallacyclic yttrium alkyl and hydrido complexes: synthesis, structures and catalytic activity in intermolecular olefin hydrophosphination and hydroamination. |
Authors of publication | Kissel, Alexander A.; Mahrova, Tatyana V.; Lyubov, Dmitry M.; Cherkasov, Anton V.; Fukin, Georgy K.; Trifonov, Alexander A.; Del Rosal, Iker; Maron, Laurent |
Journal of publication | Dalton transactions (Cambridge, England : 2003) |
Year of publication | 2015 |
Journal volume | 44 |
Journal issue | 27 |
Pages of publication | 12137 - 12148 |
a | 23.6249 ± 0.0006 Å |
b | 13.2778 ± 0.0004 Å |
c | 12.427 ± 0.0003 Å |
α | 90° |
β | 112.176 ± 0.003° |
γ | 90° |
Cell volume | 3609.83 ± 0.18 Å3 |
Cell temperature | 100 ± 2 K |
Ambient diffraction temperature | 100 ± 2 K |
Number of distinct elements | 5 |
Space group number | 5 |
Hermann-Mauguin space group symbol | C 1 2 1 |
Hall space group symbol | C 2y |
Residual factor for all reflections | 0.069 |
Residual factor for significantly intense reflections | 0.0506 |
Weighted residual factors for significantly intense reflections | 0.1179 |
Weighted residual factors for all reflections included in the refinement | 0.1264 |
Goodness-of-fit parameter for all reflections included in the refinement | 1.054 |
Diffraction radiation wavelength | 0.71073 Å |
Diffraction radiation type | MoKα |