Information card for entry 7034231
Formula | C34 H39 Cl2 In N2 O Si |
Calculated formula | C34 H39 Cl2 In N2 O Si |
Title of publication | The effect of steric changes on the isoselectivity of dinuclear indium catalysts for lactide polymerization. |
Authors of publication | Osten, K. M.; Aluthge, D. C.; Mehrkhodavandi, P. |
Journal of publication | Dalton transactions (Cambridge, England : 2003) |
Year of publication | 2015 |
Journal volume | 44 |
Journal issue | 13 |
Pages of publication | 6126 - 6139 |
a | 9.4897 ± 0.001 Å |
b | 12.2095 ± 0.0012 Å |
c | 15.9328 ± 0.0016 Å |
α | 105.831 ± 0.002° |
β | 91.856 ± 0.002° |
γ | 111.387 ± 0.002° |
Cell volume | 1635.7 ± 0.3 Å3 |
Cell temperature | 90 ± 2 K |
Ambient diffraction temperature | 90 ± 2 K |
Number of distinct elements | 7 |
Space group number | 2 |
Hermann-Mauguin space group symbol | P -1 |
Hall space group symbol | -P 1 |
Residual factor for all reflections | 0.0292 |
Residual factor for significantly intense reflections | 0.0228 |
Weighted residual factors for significantly intense reflections | 0.0537 |
Weighted residual factors for all reflections included in the refinement | 0.0572 |
Goodness-of-fit parameter for all reflections included in the refinement | 1.066 |
Diffraction radiation wavelength | 0.71073 Å |
Diffraction radiation type | MoKα |