Information card for entry 7034285
Formula | C71 H44 Dy2 F18 N4 O14 S6 |
Calculated formula | C71 H44 Dy2 F18 N4 O14 S6 |
Title of publication | Photo-control of the magnetic properties of Dy(iii) and Ho(iii) homometal coordination polymers bridged by a diarylethene ligand. |
Authors of publication | Cosquer, Goulven; Morimoto, Masakazu; Irie, Masahiro; Fetoh, Ahmed; Breedlove, Brian K.; Yamashita, Masahiro |
Journal of publication | Dalton transactions (Cambridge, England : 2003) |
Year of publication | 2015 |
Journal volume | 44 |
Journal issue | 13 |
Pages of publication | 5996 - 6002 |
a | 14.599 ± 0.003 Å |
b | 12.854 ± 0.003 Å |
c | 23.641 ± 0.004 Å |
α | 90° |
β | 97.627 ± 0.004° |
γ | 90° |
Cell volume | 4397.1 ± 1.6 Å3 |
Cell temperature | 93 ± 2 K |
Ambient diffraction temperature | 93 ± 2 K |
Number of distinct elements | 7 |
Space group number | 13 |
Hermann-Mauguin space group symbol | P 1 2/n 1 |
Hall space group symbol | -P 2yac |
Residual factor for all reflections | 0.1292 |
Residual factor for significantly intense reflections | 0.0793 |
Weighted residual factors for significantly intense reflections | 0.1853 |
Weighted residual factors for all reflections included in the refinement | 0.2235 |
Goodness-of-fit parameter for all reflections included in the refinement | 1.012 |
Diffraction radiation wavelength | 0.71073 Å |
Diffraction radiation type | MoKα |