Information card for entry 7034286
Formula | C71 H44 F18 Ho2 N4 O14 S6 |
Calculated formula | C142 H88 F36 Ho4 N8 O28 S12 |
Title of publication | Photo-control of the magnetic properties of Dy(iii) and Ho(iii) homometal coordination polymers bridged by a diarylethene ligand. |
Authors of publication | Cosquer, Goulven; Morimoto, Masakazu; Irie, Masahiro; Fetoh, Ahmed; Breedlove, Brian K.; Yamashita, Masahiro |
Journal of publication | Dalton transactions (Cambridge, England : 2003) |
Year of publication | 2015 |
Journal volume | 44 |
Journal issue | 13 |
Pages of publication | 5996 - 6002 |
a | 27.054 ± 0.008 Å |
b | 12.49 ± 0.003 Å |
c | 29.279 ± 0.008 Å |
α | 90° |
β | 115.387 ± 0.004° |
γ | 90° |
Cell volume | 8938 ± 4 Å3 |
Cell temperature | 93.15 K |
Ambient diffraction temperature | 93.15 K |
Number of distinct elements | 7 |
Space group number | 13 |
Hermann-Mauguin space group symbol | P 1 2/n 1 |
Hall space group symbol | -P 2yac |
Residual factor for all reflections | 0.081 |
Residual factor for significantly intense reflections | 0.0614 |
Weighted residual factors for significantly intense reflections | 0.1443 |
Weighted residual factors for all reflections included in the refinement | 0.1607 |
Goodness-of-fit parameter for all reflections included in the refinement | 1.096 |
Diffraction radiation wavelength | 0.710747 Å |
Diffraction radiation type | MoKα |