Information card for entry 7034287
Formula | C36 H32 Co N10 O12 |
Calculated formula | C36 H32 Co N10 O12 |
Title of publication | Solvent-induced synthesis of cobalt(ii) coordination polymers based on a rigid ligand and flexible carboxylic acid ligands: syntheses, structures and magnetic properties. |
Authors of publication | Wang, Ting; Zhang, Chuanlei; Ju, Zemin; Zheng, Hegen |
Journal of publication | Dalton transactions (Cambridge, England : 2003) |
Year of publication | 2015 |
Journal volume | 44 |
Journal issue | 15 |
Pages of publication | 6926 - 6935 |
a | 17.733 ± 0.002 Å |
b | 8.1319 ± 0.0011 Å |
c | 26.416 ± 0.004 Å |
α | 90° |
β | 101.854 ± 0.002° |
γ | 90° |
Cell volume | 3728 ± 0.9 Å3 |
Cell temperature | 293 ± 2 K |
Ambient diffraction temperature | 293 ± 2 K |
Number of distinct elements | 5 |
Space group number | 15 |
Hermann-Mauguin space group symbol | C 1 2/c 1 |
Hall space group symbol | -C 2yc |
Residual factor for all reflections | 0.0529 |
Residual factor for significantly intense reflections | 0.045 |
Weighted residual factors for significantly intense reflections | 0.1351 |
Weighted residual factors for all reflections included in the refinement | 0.1421 |
Goodness-of-fit parameter for all reflections included in the refinement | 1.055 |
Diffraction radiation wavelength | 0.71073 Å |
Diffraction radiation type | MoKα |