Information card for entry 7034288
Formula | C35 H24 Co F6 N4 O7 |
Calculated formula | C35 H24 Co F6 N4 O7 |
Title of publication | Solvent-induced synthesis of cobalt(ii) coordination polymers based on a rigid ligand and flexible carboxylic acid ligands: syntheses, structures and magnetic properties. |
Authors of publication | Wang, Ting; Zhang, Chuanlei; Ju, Zemin; Zheng, Hegen |
Journal of publication | Dalton transactions (Cambridge, England : 2003) |
Year of publication | 2015 |
Journal volume | 44 |
Journal issue | 15 |
Pages of publication | 6926 - 6935 |
a | 11.8328 ± 0.0009 Å |
b | 23.8489 ± 0.0018 Å |
c | 13.5413 ± 0.0008 Å |
α | 90° |
β | 120.368 ± 0.005° |
γ | 90° |
Cell volume | 3297 ± 0.4 Å3 |
Cell temperature | 293 ± 2 K |
Ambient diffraction temperature | 293 ± 2 K |
Number of distinct elements | 6 |
Space group number | 14 |
Hermann-Mauguin space group symbol | P 1 21/c 1 |
Hall space group symbol | -P 2ybc |
Residual factor for all reflections | 0.0676 |
Residual factor for significantly intense reflections | 0.0484 |
Weighted residual factors for significantly intense reflections | 0.1343 |
Weighted residual factors for all reflections included in the refinement | 0.1587 |
Goodness-of-fit parameter for all reflections included in the refinement | 1.074 |
Diffraction radiation wavelength | 0.71073 Å |
Diffraction radiation type | MoKα |