Information card for entry 7034289
Formula | C104 H58 Co4 F24 N8 O19 |
Calculated formula | C104 H58 Co4 F24 N8 O19 |
Title of publication | Solvent-induced synthesis of cobalt(ii) coordination polymers based on a rigid ligand and flexible carboxylic acid ligands: syntheses, structures and magnetic properties. |
Authors of publication | Wang, Ting; Zhang, Chuanlei; Ju, Zemin; Zheng, Hegen |
Journal of publication | Dalton transactions (Cambridge, England : 2003) |
Year of publication | 2015 |
Journal volume | 44 |
Journal issue | 15 |
Pages of publication | 6926 - 6935 |
a | 16.2799 ± 0.0008 Å |
b | 7.2214 ± 0.0004 Å |
c | 24.2716 ± 0.001 Å |
α | 90° |
β | 116.419 ± 0.003° |
γ | 90° |
Cell volume | 2555.5 ± 0.2 Å3 |
Cell temperature | 293 ± 2 K |
Ambient diffraction temperature | 293 ± 2 K |
Number of distinct elements | 6 |
Space group number | 13 |
Hermann-Mauguin space group symbol | P 1 2/c 1 |
Hall space group symbol | -P 2yc |
Residual factor for all reflections | 0.0343 |
Residual factor for significantly intense reflections | 0.0321 |
Weighted residual factors for significantly intense reflections | 0.0998 |
Weighted residual factors for all reflections included in the refinement | 0.102 |
Goodness-of-fit parameter for all reflections included in the refinement | 1.023 |
Diffraction radiation wavelength | 0.71073 Å |
Diffraction radiation type | MoKα |