Information card for entry 7034290
Formula | C32 H23 Co N5 O6 |
Calculated formula | C32 H23 Co N5 O6 |
Title of publication | Solvent-induced synthesis of cobalt(ii) coordination polymers based on a rigid ligand and flexible carboxylic acid ligands: syntheses, structures and magnetic properties. |
Authors of publication | Wang, Ting; Zhang, Chuanlei; Ju, Zemin; Zheng, Hegen |
Journal of publication | Dalton transactions (Cambridge, England : 2003) |
Year of publication | 2015 |
Journal volume | 44 |
Journal issue | 15 |
Pages of publication | 6926 - 6935 |
a | 22.639 ± 0.007 Å |
b | 22.322 ± 0.007 Å |
c | 14.117 ± 0.005 Å |
α | 90° |
β | 108.63 ± 0.005° |
γ | 90° |
Cell volume | 6760 ± 4 Å3 |
Cell temperature | 293 ± 2 K |
Ambient diffraction temperature | 293 ± 2 K |
Number of distinct elements | 5 |
Space group number | 15 |
Hermann-Mauguin space group symbol | C 1 2/c 1 |
Hall space group symbol | -C 2yc |
Residual factor for all reflections | 0.1168 |
Residual factor for significantly intense reflections | 0.0839 |
Weighted residual factors for significantly intense reflections | 0.2215 |
Weighted residual factors for all reflections included in the refinement | 0.2424 |
Goodness-of-fit parameter for all reflections included in the refinement | 1.049 |
Diffraction radiation wavelength | 0.71073 Å |
Diffraction radiation type | MoKα |