Information card for entry 7034613
Formula | C14 H18 Ag F3 N6 O8 |
Calculated formula | C14 H18 Ag F3 N6 O8 |
Title of publication | Synthesis, characterization and antimicrobial activity of water-soluble silver(i) complexes of metronidazole drug and selected counter-ions. |
Authors of publication | Kalinowska-Lis, Urszula; Felczak, Aleksandra; Chęcińska, Lilianna; Zawadzka, Katarzyna; Patyna, Emilia; Lisowska, Katarzyna; Ochocki, Justyn |
Journal of publication | Dalton transactions (Cambridge, England : 2003) |
Year of publication | 2015 |
Journal volume | 44 |
Journal issue | 17 |
Pages of publication | 8178 - 8189 |
a | 10.8445 ± 0.0001 Å |
b | 6.6393 ± 0.0001 Å |
c | 28.8769 ± 0.0003 Å |
α | 90° |
β | 107.267 ± 0.001° |
γ | 90° |
Cell volume | 1985.43 ± 0.04 Å3 |
Cell temperature | 100 ± 2 K |
Ambient diffraction temperature | 100 ± 2 K |
Number of distinct elements | 6 |
Space group number | 14 |
Hermann-Mauguin space group symbol | P 1 21/c 1 |
Hall space group symbol | -P 2ybc |
Residual factor for all reflections | 0.0235 |
Residual factor for significantly intense reflections | 0.0226 |
Weighted residual factors for significantly intense reflections | 0.0544 |
Weighted residual factors for all reflections included in the refinement | 0.055 |
Goodness-of-fit parameter for all reflections included in the refinement | 1.117 |
Diffraction radiation wavelength | 0.71073 Å |
Diffraction radiation type | MoKα |