Information card for entry 7034663
Formula | C84 H68 Cl6 Cu6 N14 O50 Si W12 |
Calculated formula | C84 H56 Cl6 Cu6 N14 O50 Si W12 |
Title of publication | Polyoxometalate-based organic-inorganic hybrid compounds containing transition metal mixed-organic-ligand complexes of N-containing and pyridinecarboxylate ligands. |
Authors of publication | Zhao, De-Chuan; Hu, Yang-Yang; Ding, Hong; Guo, Hai-Yang; Cui, Xiao-Bing; Zhang, Xiao; Huo, Qi-Sheng; Xu, Ji-Qing |
Journal of publication | Dalton transactions (Cambridge, England : 2003) |
Year of publication | 2015 |
Journal volume | 44 |
Journal issue | 19 |
Pages of publication | 8971 - 8983 |
a | 11.702 ± 0.002 Å |
b | 14.419 ± 0.003 Å |
c | 18.071 ± 0.004 Å |
α | 71.19 ± 0.03° |
β | 88.84 ± 0.03° |
γ | 80.19 ± 0.03° |
Cell volume | 2842.1 ± 1.2 Å3 |
Cell temperature | 293 ± 2 K |
Ambient diffraction temperature | 293 ± 2 K |
Number of distinct elements | 8 |
Space group number | 2 |
Hermann-Mauguin space group symbol | P -1 |
Hall space group symbol | -P 1 |
Residual factor for all reflections | 0.0666 |
Residual factor for significantly intense reflections | 0.0558 |
Weighted residual factors for significantly intense reflections | 0.1232 |
Weighted residual factors for all reflections included in the refinement | 0.1295 |
Goodness-of-fit parameter for all reflections included in the refinement | 1.007 |
Diffraction radiation wavelength | 0.71073 Å |
Diffraction radiation type | MoKα |